Year,Term,YearTerm,Subject,Number,Name,Description,Credit Hours,Section Info,Degree Attributes,Schedule Information,CRN,Section,Status Code,Part of Term,Section Title,Section Credit Hours,Section Status,Enrollment Status,Type,Type Code,Start Time,End Time,Days of Week,Room,Building,Instructors
2024,Spring,2024-sp,AAS,100,Intro Asian American Studies,"Interdisciplinary introduction to the basic concepts and approaches in Asian American Studies. Surveys the various dimensions of Asian American experiences including history, social organization, literature, arts, and politics.",3 hours.,,"Social & Beh Sci - Soc Sci, and Cultural Studies - US Minority course.",,30107,AD1,A,1,,,A,Open,Discussion/Recitation,DIS,09:00 AM,09:50 AM,F,1128,"Literatures, Cultures, & Ling","Guruparan, A;Zheng, R"
2024,Spring,2024-sp,AAS,100,Intro Asian American Studies,"Interdisciplinary introduction to the basic concepts and approaches in Asian American Studies. Surveys the various dimensions of Asian American experiences including history, social organization, literature, arts, and politics.",3 hours.,,"Social & Beh Sci - Soc Sci, and Cultural Studies - US Minority course.",,41729,AD2,A,1,,,A,Open,Discussion/Recitation,DIS,10:00 AM,10:50 AM,F,1030,"Literatures, Cultures, & Ling","Guruparan, A;Zheng, R"
2024,Spring,2024-sp,AAS,100,Intro Asian American Studies,"Interdisciplinary introduction to the basic concepts and approaches in Asian American Studies. Surveys the various dimensions of Asian American experiences including history, social organization, literature, arts, and politics.",3 hours.,,"Social & Beh Sci - Soc Sci, and Cultural Studies - US Minority course.",,43832,AD3,A,1,,,A,Open,Discussion/Recitation,DIS,11:00 AM,11:50 AM,F,1038,"Literatures, Cultures, & Ling","Chapekar, P;Guruparan, A"
2024,Spring,2024-sp,AAS,100,Intro Asian American Studies,"Interdisciplinary introduction to the basic concepts and approaches in Asian American Studies. Surveys the various dimensions of Asian American experiences including history, social organization, literature, arts, and politics.",3 hours.,,"Social & Beh Sci - Soc Sci, and Cultural Studies - US Minority course.",,48232,AD4,A,1,,,A,Open,Discussion/Recitation,DIS,12:00 PM,12:50 PM,F,1120,"Literatures, Cultures, & Ling","Guruparan, A;Wang, Y"
2024,Spring,2024-sp,AAS,100,Intro Asian American Studies,"Interdisciplinary introduction to the basic concepts and approaches in Asian American Studies. Surveys the various dimensions of Asian American experiences including history, social organization, literature, arts, and politics.",3 hours.,,"Social & Beh Sci - Soc Sci, and Cultural Studies - US Minority course.",,48234,AD5,A,1,,,A,Open,Discussion/Recitation,DIS,01:00 PM,01:50 PM,F,1120,"Literatures, Cultures, & Ling","Guruparan, A;Roy, S"
2024,Spring,2024-sp,AAS,100,Intro Asian American Studies,"Interdisciplinary introduction to the basic concepts and approaches in Asian American Studies. Surveys the various dimensions of Asian American experiences including history, social organization, literature, arts, and politics.",3 hours.,,"Social & Beh Sci - Soc Sci, and Cultural Studies - US Minority course.",,50105,AD6,A,1,,,A,Open,Discussion/Recitation,DIS,02:00 PM,02:50 PM,F,1136,"Literatures, Cultures, & Ling","Guruparan, A;Roy, S"
2024,Spring,2024-sp,AAS,100,Intro Asian American Studies,"Interdisciplinary introduction to the basic concepts and approaches in Asian American Studies. Surveys the various dimensions of Asian American experiences including history, social organization, literature, arts, and politics.",3 hours.,,"Social & Beh Sci - Soc Sci, and Cultural Studies - US Minority course.",,54572,AD7,A,1,,,A,Open,Discussion/Recitation,DIS,10:00 AM,10:50 AM,F,G48,"Literatures, Cultures, & Ling","Chapekar, P;Guruparan, A"
2024,Spring,2024-sp,AAS,100,Intro Asian American Studies,"Interdisciplinary introduction to the basic concepts and approaches in Asian American Studies. Surveys the various dimensions of Asian American experiences including history, social organization, literature, arts, and politics.",3 hours.,,"Social & Beh Sci - Soc Sci, and Cultural Studies - US Minority course.",,51886,AD8,A,1,,,A,Open,Discussion/Recitation,DIS,11:00 AM,11:50 AM,F,G48,"Literatures, Cultures, & Ling","Guruparan, A;Wang, Y"
2024,Spring,2024-sp,AAS,100,Intro Asian American Studies,"Interdisciplinary introduction to the basic concepts and approaches in Asian American Studies. Surveys the various dimensions of Asian American experiences including history, social organization, literature, arts, and politics.",3 hours.,,"Social & Beh Sci - Soc Sci, and Cultural Studies - US Minority course.",,70761,AD9,A,1,,,A,Open,Discussion/Recitation,DIS,01:00 PM,01:50 PM,F,1038,"Literatures, Cultures, & Ling","Guruparan, A;Mukhopadhyay, A"
2024,Spring,2024-sp,AAS,100,Intro Asian American Studies,"Interdisciplinary introduction to the basic concepts and approaches in Asian American Studies. Surveys the various dimensions of Asian American experiences including history, social organization, literature, arts, and politics.",3 hours.,,"Social & Beh Sci - Soc Sci, and Cultural Studies - US Minority course.",,70762,ADA,A,1,,,A,Open,Discussion/Recitation,DIS,02:00 PM,02:50 PM,F,1022,"Literatures, Cultures, & Ling","Guruparan, A;Mukhopadhyay, A"
2024,Spring,2024-sp,AAS,100,Intro Asian American Studies,"Interdisciplinary introduction to the basic concepts and approaches in Asian American Studies. Surveys the various dimensions of Asian American experiences including history, social organization, literature, arts, and politics.",3 hours.,,"Social & Beh Sci - Soc Sci, and Cultural Studies - US Minority course.",,30106,AL1,A,1,,,A,Open,Lecture,LEC,10:00 AM,10:50 AM,MW,112,Gregory Hall,"Guruparan, A"
2024,Spring,2024-sp,AAS,200,U.S. Race and Empire,"Invites students to examine histories and narratives of U.S. race and empire, drawing upon multiple theoretical and methodological works in Asian American studies and related fields. Same as LLS 200.",3 hours.,Same as LLS 200.,"Humanities - Hist & Phil, and Cultural Studies - US Minority course.",,64396,A,A,1,,,A,Closed,Lecture-Discussion,LCD,02:30 PM,03:50 PM,TR,150,English Building,"Sawada, E"
2024,Spring,2024-sp,AAS,201,US Racial &amp; Ethnic Politics,"Same as AFRO 201, LLS 201, and PS 201. See PS 201.",3 hours.,"Same as AFRO 201, LLS 201, and PS 201. See PS 201.","Social & Beh Sci - Soc Sci, and Cultural Studies - US Minority course.",,66639,OL1,A,A,,,A,CrossListOpen,Online,ONL,ARRANGED,,,,,"Griffin, C"
2024,Spring,2024-sp,AAS,201,US Racial &amp; Ethnic Politics,"Same as AFRO 201, LLS 201, and PS 201. See PS 201.",3 hours.,"Same as AFRO 201, LLS 201, and PS 201. See PS 201.","Social & Beh Sci - Soc Sci, and Cultural Studies - US Minority course.",,66638,OL2,A,B,,,A,Closed,Online,ONL,ARRANGED,,,,,"Raynal, I"
2024,Spring,2024-sp,AAS,201,US Racial &amp; Ethnic Politics,"Same as AFRO 201, LLS 201, and PS 201. See PS 201.",3 hours.,"Same as AFRO 201, LLS 201, and PS 201. See PS 201.","Social & Beh Sci - Soc Sci, and Cultural Studies - US Minority course.",,65823,OL3,A,B,,,A,Closed,Online,ONL,ARRANGED,,,,,"Lewis, A"
2024,Spring,2024-sp,AAS,275,The Politics of Fashion,Same as GWS 275. See GWS 275.,3 hours.,Same as GWS 275. See GWS 275.,Cultural Studies - US Minority course.,,75612,AD1,A,1,,,A,Closed,Discussion/Recitation,DIS,02:00 PM,02:50 PM,F,336,Davenport Hall,"Cornell, M;Nguyen, M"
2024,Spring,2024-sp,AAS,275,The Politics of Fashion,Same as GWS 275. See GWS 275.,3 hours.,Same as GWS 275. See GWS 275.,Cultural Studies - US Minority course.,,75615,AD2,A,1,,,A,Closed,Discussion/Recitation,DIS,02:00 PM,02:50 PM,R,315,Gregory Hall,"Nguyen, M;Pehl, E"
2024,Spring,2024-sp,AAS,275,The Politics of Fashion,Same as GWS 275. See GWS 275.,3 hours.,Same as GWS 275. See GWS 275.,Cultural Studies - US Minority course.,,75616,AD3,A,1,,,A,CrossListOpen,Discussion/Recitation,DIS,04:00 PM,04:50 PM,R,221,Gregory Hall,"Nguyen, M;Pehl, E"
2024,Spring,2024-sp,AAS,275,The Politics of Fashion,Same as GWS 275. See GWS 275.,3 hours.,Same as GWS 275. See GWS 275.,Cultural Studies - US Minority course.,,75619,AD4,A,1,,,A,CrossListOpen,Discussion/Recitation,DIS,09:00 AM,09:50 AM,F,212,Davenport Hall,"Nguyen, M;Turner, R"
2024,Spring,2024-sp,AAS,275,The Politics of Fashion,Same as GWS 275. See GWS 275.,3 hours.,Same as GWS 275. See GWS 275.,Cultural Studies - US Minority course.,,75620,AD5,A,1,,,A,CrossListOpen,Discussion/Recitation,DIS,11:00 AM,11:50 AM,F,1022,"Literatures, Cultures, & Ling","Nguyen, M;Turner, R"
2024,Spring,2024-sp,AAS,275,The Politics of Fashion,Same as GWS 275. See GWS 275.,3 hours.,Same as GWS 275. See GWS 275.,Cultural Studies - US Minority course.,,75622,AD6,A,1,,,A,Closed,Discussion/Recitation,DIS,03:00 PM,03:50 PM,W,312,Davenport Hall,"Henningsen, K;Nguyen, M"
2024,Spring,2024-sp,AAS,275,The Politics of Fashion,Same as GWS 275. See GWS 275.,3 hours.,Same as GWS 275. See GWS 275.,Cultural Studies - US Minority course.,,75623,AD7,A,1,,,A,CrossListOpen,Discussion/Recitation,DIS,04:00 PM,04:50 PM,W,113,Davenport Hall,"Henningsen, K;Nguyen, M"
2024,Spring,2024-sp,AAS,275,The Politics of Fashion,Same as GWS 275. See GWS 275.,3 hours.,Same as GWS 275. See GWS 275.,Cultural Studies - US Minority course.,,75611,AL1,A,1,,,A,CrossListOpen,Lecture,LEC,01:00 PM,01:50 PM,MW,180,Bevier Hall,"Nguyen, M"
2024,Spring,2024-sp,AAS,283,Asian American History,Same as HIST 283. See HIST 283.,3 hours.,Same as HIST 283. See HIST 283.,"Humanities - Hist & Phil, and Cultural Studies - US Minority course.",,34129,A,A,1,,,A,CrossListOpen,Lecture-Discussion,LCD,10:00 AM,11:20 AM,MW,3101,Sidney Lu Mech Engr Bldg,"Espiritu, A"
2024,Spring,2024-sp,AAS,286,Asian American Literature,Same as ENGL 286. See ENGL 286.,3 hours.,Same as ENGL 286. See ENGL 286.,"Humanities - Lit & Arts, and Cultural Studies - US Minority course.",,32112,P,A,1,,,A,Closed,Lecture-Discussion,LCD,11:00 AM,12:15 PM,TR,150,English Building,"Chatterjee, D"
2024,Spring,2024-sp,AAS,297,Asian Families in America,Same as HDFS 221 and SOCW 297. See SOCW 297.,3 hours.,Same as HDFS 221 and SOCW 297. See SOCW 297.,"Social & Beh Sci - Soc Sci, and Cultural Studies - US Minority course.",,62166,A,A,1,,,A,Closed,Lecture-Discussion,LCD,05:15 PM,06:30 PM,MW,132,Bevier Hall,"Balgopal, A"
2024,Spring,2024-sp,AAS,297,Asian Families in America,Same as HDFS 221 and SOCW 297. See SOCW 297.,3 hours.,Same as HDFS 221 and SOCW 297. See SOCW 297.,"Social & Beh Sci - Soc Sci, and Cultural Studies - US Minority course.",,73220,B,A,1,,,A,Closed,Lecture-Discussion,LCD,09:30 AM,10:45 AM,TR,302,Architecture Building,"Chih, D"
2024,Spring,2024-sp,AAS,300,"Theories of Race, Gender, and Sexuality","Explores theories for performing interdisciplinary, intersectional and comparative studies within the field of Asian American studies. Follows multiple genealogies of critical work in ethnic and American studies. Same as GWS 305 and LLS 305.",3 hours.,Same as GWS 305 and LLS 305.,Advanced Composition course.,,69047,B,A,1,,,A,Closed,Lecture-Discussion,LCD,01:00 PM,02:20 PM,TR,236,Wohlers Hall,"Bui, K"
2024,Spring,2024-sp,AAS,310,Race and Cultural Diversity,"Same as AFRO 310, EPOL 310, EPS 310, and LLS 310. See EPOL 310.",4 hours.,"Same as AFRO 310, EPOL 310, EPS 310, and LLS 310. See EPOL 310.","Advanced Composition, and Cultural Studies - US Minority course.",,33071,D1,A,1,,,A,Closed,Discussion/Recitation,DIS,02:00 PM,03:50 PM,R,17,Education Building,"Galloway, M;Moton, T"
2024,Spring,2024-sp,AAS,310,Race and Cultural Diversity,"Same as AFRO 310, EPOL 310, EPS 310, and LLS 310. See EPOL 310.",4 hours.,"Same as AFRO 310, EPOL 310, EPS 310, and LLS 310. See EPOL 310.","Advanced Composition, and Cultural Studies - US Minority course.",,45579,D2,A,1,,,A,Closed,Discussion/Recitation,DIS,02:00 PM,03:50 PM,R,22,Education Building,"Moton, T;Velasco, K"
2024,Spring,2024-sp,AAS,310,Race and Cultural Diversity,"Same as AFRO 310, EPOL 310, EPS 310, and LLS 310. See EPOL 310.",4 hours.,"Same as AFRO 310, EPOL 310, EPS 310, and LLS 310. See EPOL 310.","Advanced Composition, and Cultural Studies - US Minority course.",,45586,D3,A,1,,,A,Closed,Discussion/Recitation,DIS,02:00 PM,03:50 PM,R,389,Education Building,"Moton, T;Wilson, D"
2024,Spring,2024-sp,AAS,310,Race and Cultural Diversity,"Same as AFRO 310, EPOL 310, EPS 310, and LLS 310. See EPOL 310.",4 hours.,"Same as AFRO 310, EPOL 310, EPS 310, and LLS 310. See EPOL 310.","Advanced Composition, and Cultural Studies - US Minority course.",,33069,L,A,1,,,A,Closed,Lecture,LEC,02:00 PM,03:50 PM,T,22,Education Building,"Moton, T"
2024,Spring,2024-sp,AAS,355,Race and Mixed Race,Same as LLS 355 and SOC 355. See LLS 355.,3 hours.,Same as LLS 355 and SOC 355. See LLS 355.,,,57160,A,A,1,,,A,Closed,Lecture-Discussion,LCD,12:30 PM,01:50 PM,TR,313,Gregory Hall,"Lule, L"
2024,Spring,2024-sp,AAS,357,Literatures of the Displaced,"Same as AIS 357, ENGL 357, GWS 357, and LLS 357. See LLS 357.",3 hours.,"Same as AIS 357, ENGL 357, GWS 357, and LLS 357. See LLS 357.",,,70259,A,A,1,,,A,CrossListOpen,Lecture-Discussion,LCD,10:30 AM,11:50 AM,MW,325,David Kinley Hall,"Lule, L"
2024,Spring,2024-sp,AAS,465,"Race, Sex, and Deviance","Same as AFRO 465, GWS 465, and LLS 465. See LLS 465.",3 OR 4 hours.,"Same as AFRO 465, GWS 465, and LLS 465. See LLS 465.",,,48488,G,A,1,,4 hours,A,Closed,Lecture-Discussion,LCD,03:00 PM,05:20 PM,M,3038,Campus Instructional Facility,"Flores, N"
2024,Spring,2024-sp,AAS,465,"Race, Sex, and Deviance","Same as AFRO 465, GWS 465, and LLS 465. See LLS 465.",3 OR 4 hours.,"Same as AFRO 465, GWS 465, and LLS 465. See LLS 465.",,,48487,U,A,1,,3 hours,A,Closed,Lecture-Discussion,LCD,03:00 PM,05:20 PM,M,3038,Campus Instructional Facility,"Flores, N"
2024,Spring,2024-sp,AAS,589,Readings in Asian Am Studies,Individual guidance in intensive readings in the literature of one or more subdivisions of the field of Asian American Studies. May be repeated to a maximum of 8 hours. Students may register in more than one section per term if topics vary. Prerequisite: Graduate standing or consent of instructor.,1 TO 4 hours.,May be repeated to a maximum of 8 hours. Students may register in more than one section per term if topics vary. Prerequisite: Graduate standing or consent of instructor.,,,73909,A,A,1,,4 hours,A,Closed,Independent Study,IND,ARRANGED,,,,,"Espiritu, A"
2024,Spring,2024-sp,AAS,590,Asian Am Studies Seminar,Approved for letter and S/U grading. May be repeated to a maximum of 8 hours. Prerequisite: Graduate standing or consent of instructor.,2 TO 4 hours.,Approved for letter and S/U grading. May be repeated to a maximum of 8 hours. Prerequisite: Graduate standing or consent of instructor.,,,76064,D,A,1,Improvise and Intervene,4 hours,A,Closed,Lecture-Discussion,LCD,04:00 PM,07:00 PM,T,1046,"Literatures, Cultures, & Ling","Kashani, M;Rana, J;Velasquez Estrada, E"
2024,Spring,2024-sp,ABE,128,Applied Biology for Agricultural and Biological Engineers,"Principles of biology relevant to agriculture, food, energy, and the environment, including microbiology, biochemistry, genetics, plant and animal systems, and ecosystems. Case studies of engineering applications where these biological principles have been taken into account or leveraged for the purpose of design. Credit not given for both ABE 128 and ABE 141.",3 hours.,Credit not given for both ABE 128 and ABE 141.,,,75643,LB1,A,1,,,A,Open,Laboratory,LAB,02:00 PM,04:50 PM,W,M5,Turner Hall,"Leonelli, L"
2024,Spring,2024-sp,ABE,128,Applied Biology for Agricultural and Biological Engineers,"Principles of biology relevant to agriculture, food, energy, and the environment, including microbiology, biochemistry, genetics, plant and animal systems, and ecosystems. Case studies of engineering applications where these biological principles have been taken into account or leveraged for the purpose of design. Credit not given for both ABE 128 and ABE 141.",3 hours.,Credit not given for both ABE 128 and ABE 141.,,,75643,LB1,A,1,,,A,Open,Lecture,LEC,10:00 AM,10:50 AM,MW,208,Agricultural Engr Sciences Bld,"Leonelli, L"
2024,Spring,2024-sp,ABE,128,Applied Biology for Agricultural and Biological Engineers,"Principles of biology relevant to agriculture, food, energy, and the environment, including microbiology, biochemistry, genetics, plant and animal systems, and ecosystems. Case studies of engineering applications where these biological principles have been taken into account or leveraged for the purpose of design. Credit not given for both ABE 128 and ABE 141.",3 hours.,Credit not given for both ABE 128 and ABE 141.,,,75846,LB2,A,1,,,A,Open,Laboratory,LAB,02:00 PM,04:50 PM,R,M5,Turner Hall,"Leonelli, L"
2024,Spring,2024-sp,ABE,128,Applied Biology for Agricultural and Biological Engineers,"Principles of biology relevant to agriculture, food, energy, and the environment, including microbiology, biochemistry, genetics, plant and animal systems, and ecosystems. Case studies of engineering applications where these biological principles have been taken into account or leveraged for the purpose of design. Credit not given for both ABE 128 and ABE 141.",3 hours.,Credit not given for both ABE 128 and ABE 141.,,,75846,LB2,A,1,,,A,Open,Lecture,LEC,10:00 AM,10:50 AM,MW,208,Agricultural Engr Sciences Bld,"Leonelli, L"
2024,Spring,2024-sp,ABE,152,Water in the Global Environment,"This course develops a comprehensive understanding and appreciation of water and its impact in a global context. The course emphasizes cultural practices associated with water and its use, especially for regions in non-western cultures. Students will develop critical knowledge of: 1) water availability, water quality, and global challenges; 2) historical perspectives of water use; 3) past, present, and future environmental sustainability in relation to water, food, and energy; and 4) conduct analysis of cultural practices and their sustainability based on water in a global context. Students attend 3-4 field trips related to the course.",3 hours.,,"Cultural Studies - Non-West, and Nat Sci & Tech - Phys Sciences course.",,73114,WGE,A,B,,3 hours,A,Open,Online,ONL,01:00 PM,02:50 PM,MW,,,"Bhattarai, R;Davidson, P;Kalita, P"
2024,Spring,2024-sp,ABE,199,Undergraduate Open Seminar,May be repeated to a maximum of 12 hours.,1 TO 5 hours.,May be repeated to a maximum of 12 hours.,,,10141,,A,1,,,A,Open (Restricted),Independent Study,IND,ARRANGED,,,,,
2024,Spring,2024-sp,ABE,199,Undergraduate Open Seminar,May be repeated to a maximum of 12 hours.,1 TO 5 hours.,May be repeated to a maximum of 12 hours.,,,68015,AMB,A,1,ABE@IL Ambassador Training,1 hours,A,Open (Restricted),Discussion/Recitation,DIS,ARRANGED,,,,,"Boone, A"
2024,Spring,2024-sp,ABE,225,ABE Principles: Bioenvironment,"Principles of environmental control for biological structures: psychrometrics; mass and heat transfer through buildings; ventilation requirements. Prerequisite: One of MATH 220, MATH 221, MATH 234.",2 hours.,"Prerequisite: One of MATH 220, MATH 221, MATH 234.",,,57090,AB1,A,A,,,A,Open,Laboratory,LAB,08:00 AM,09:50 AM,F,242,Agricultural Engr Sciences Bld,"Zhang, Y"
2024,Spring,2024-sp,ABE,225,ABE Principles: Bioenvironment,"Principles of environmental control for biological structures: psychrometrics; mass and heat transfer through buildings; ventilation requirements. Prerequisite: One of MATH 220, MATH 221, MATH 234.",2 hours.,"Prerequisite: One of MATH 220, MATH 221, MATH 234.",,,57091,AB2,A,A,,,A,Open,Laboratory,LAB,10:00 AM,11:50 AM,F,242,Agricultural Engr Sciences Bld,"Zhang, Y"
2024,Spring,2024-sp,ABE,225,ABE Principles: Bioenvironment,"Principles of environmental control for biological structures: psychrometrics; mass and heat transfer through buildings; ventilation requirements. Prerequisite: One of MATH 220, MATH 221, MATH 234.",2 hours.,"Prerequisite: One of MATH 220, MATH 221, MATH 234.",,,57089,AE1,A,A,,,A,Open,Lecture-Discussion,LCD,08:30 AM,09:50 AM,TR,208,Agricultural Engr Sciences Bld,"Zhang, Y"
2024,Spring,2024-sp,ABE,226,ABE Principles: Bioprocessing,"Principles of bioprocess engineering applied to food and agricultural products: material balances; fluid flow; heat and mass transfers; drying; evaporation; fermentation; distillation; process simulation. Prerequisite: One of MATH 220, MATH 221, MATH 234.",2 hours.,"Prerequisite: One of MATH 220, MATH 221, MATH 234.",,,57087,AB1,A,B,,,A,Open,Laboratory,LAB,08:00 AM,09:50 AM,F,242,Agricultural Engr Sciences Bld,"Singh, V"
2024,Spring,2024-sp,ABE,226,ABE Principles: Bioprocessing,"Principles of bioprocess engineering applied to food and agricultural products: material balances; fluid flow; heat and mass transfers; drying; evaporation; fermentation; distillation; process simulation. Prerequisite: One of MATH 220, MATH 221, MATH 234.",2 hours.,"Prerequisite: One of MATH 220, MATH 221, MATH 234.",,,57088,AB2,A,B,,,A,Open,Laboratory,LAB,10:00 AM,11:50 AM,F,242,Agricultural Engr Sciences Bld,"Singh, V"
2024,Spring,2024-sp,ABE,226,ABE Principles: Bioprocessing,"Principles of bioprocess engineering applied to food and agricultural products: material balances; fluid flow; heat and mass transfers; drying; evaporation; fermentation; distillation; process simulation. Prerequisite: One of MATH 220, MATH 221, MATH 234.",2 hours.,"Prerequisite: One of MATH 220, MATH 221, MATH 234.",,,57086,AE1,A,B,,,A,Open,Lecture-Discussion,LCD,08:30 AM,09:50 AM,TR,208,Agricultural Engr Sciences Bld,"Singh, V"
2024,Spring,2024-sp,ABE,232,Context in International Interventions,"This multi-disciplinary course will examine a new approach to infrastructure engineering for alternately developed societies that seeks to counteract the disconnects and differing objectives among project stakeholders that result in lack of infrastructure sustainability and resiliency. Using a case study from Western Africa, the course will consider the impact of globalization, the attitudes of industrialized societies, and the role of place-based knowledge in designing and implementing infrastructure interventions for rural societies. Same as AFST 233.",3 hours.,Same as AFST 233.,"Cultural Studies - Non-West, and Social & Beh Sci - Soc Sci course.",,76255,AW,A,B,,3 hours,A,CrossListOpen,Online Lecture,OLC,01:00 PM,02:50 PM,MWF,,,"Witmer, A"
2024,Spring,2024-sp,ABE,341,Transport Processes in ABE,"Principles of transport processes involving momentum, heat, and mass as applied to biological systems in agriculture, food, energy, and the environment. Credit is not given for both ABE 341 and CHBE 421. Prerequisite: ABE 223, ABE 224, ABE 225, ABE 226, and PHYS 213.",3 hours.,"Credit is not given for both ABE 341 and CHBE 421. Prerequisite: ABE 223, ABE 224, ABE 225, ABE 226, and PHYS 213.",,,74560,KDR,A,1,,3 hours,A,Open,Lecture,LEC,11:00 AM,11:50 AM,F,208,Agricultural Engr Sciences Bld,"Rausch, K"
2024,Spring,2024-sp,ABE,341,Transport Processes in ABE,"Principles of transport processes involving momentum, heat, and mass as applied to biological systems in agriculture, food, energy, and the environment. Credit is not given for both ABE 341 and CHBE 421. Prerequisite: ABE 223, ABE 224, ABE 225, ABE 226, and PHYS 213.",3 hours.,"Credit is not given for both ABE 341 and CHBE 421. Prerequisite: ABE 223, ABE 224, ABE 225, ABE 226, and PHYS 213.",,,74560,KDR,A,1,,3 hours,A,Open,Lecture,LEC,11:00 AM,11:50 AM,MW,208,Agricultural Engr Sciences Bld,"Rausch, K"
2024,Spring,2024-sp,ABE,361,Functional Analysis and Design of Agricultural Machine Systems,"Design and development concepts of agricultural machines; analysis and synthesis of tillage, planting, harvesting, chemical application, material handling mechanisms, and precision farming tools. Prerequisite: TAM 212.",3 hours.,Prerequisite: TAM 212.,,,75748,AB1,A,1,,,A,Open,Laboratory,LAB,09:00 AM,11:50 AM,F,248,Agricultural Engr Sciences Bld,"Allen, C"